BDBM50147156 2,2,2-Trifluoro-ethanesulfonic acid (3-cyclopentyloxy-phenyl)-pyridin-3-ylmethyl-amide::CHEMBL321968
SMILES FC(F)(F)CS(=O)(=O)N(Cc1cccnc1)c1cccc(OC2CCCC2)c1
InChI Key InChIKey=WCYYNLFGFUQJMF-UHFFFAOYSA-N
Data  1 EC50
  Tab Delimited (TSV)   2D SDfile   Computed 3D by Vconf -m prep SDfile
Find this compound or compounds like it in BindingDB:
Activity Spreadsheet -- Enzyme Inhibition Constant Data from BindingDB
Found 1 hit for monomerid = 50147156
TargetMetabotropic glutamate receptor 2(Homo sapiens (Human))
Eli Lilly
Curated by ChEMBL
LigandPNGBDBM50147156(2,2,2-Trifluoro-ethanesulfonic acid (3-cyclopentyl...)
Affinity DataEC50:  24nM. Assay description: Effective concentration against metabotropic glutamate receptor 2
In DepthDetails ArticlePubMed