BDBM50147225 3'N-(2-hexahydro-1-pyridinylethyl)-1-[4-(2-fluorophenylcarboxamido)benzoyl]spiro[2,3,4,5-tetrahydro-1H-benzo[b]azepine-4,1'-(2'-cyclopentene)]-3'-carboxamide::CHEMBL432973
SMILES Fc1ccccc1C(=O)Nc1ccc(cc1)C(=O)N1CCC2(CCC(=C2)C(=O)NCCN2CCCCC2)Cc2ccccc12
InChI Key InChIKey=ALTXCOPWMUDTBZ-UHFFFAOYSA-N
Data  4 IC50
  Tab Delimited (TSV)   2D SDfile   Computed 3D by Vconf -m prep SDfile
Find this compound or compounds like it in BindingDB:
Activity Spreadsheet -- Enzyme Inhibition Constant Data from BindingDB
Found 4 hits for monomerid = 50147225
TargetVasopressin V1a receptor(Homo sapiens (Human))
Johnson And Johnson Pharmaceutical Research And Development
Curated by ChEMBL
LigandPNGBDBM50147225(3'N-(2-hexahydro-1-pyridinylethyl)-1-[4-(2-fluorop...)
Affinity DataIC50:  7nM. Assay description: Binding affinity measured by inhibition of 3[H] AVP binding to cloned human vasopressin V1a receptor
In DepthDetails ArticlePubMed
TargetVasopressin V1a receptor(Homo sapiens (Human))
Johnson And Johnson Pharmaceutical Research And Development
Curated by ChEMBL
LigandPNGBDBM50147225(3'N-(2-hexahydro-1-pyridinylethyl)-1-[4-(2-fluorop...)
Affinity DataIC50:  950nM. Assay description: Evaluated for intracellular calcium mobilization in HEK293 cells transfected to express human vasopressin V1a receptor
In DepthDetails ArticlePubMed
TargetVasopressin V2 receptor(Homo sapiens (Human))
Johnson And Johnson Pharmaceutical Research And Development
Curated by ChEMBL
LigandPNGBDBM50147225(3'N-(2-hexahydro-1-pyridinylethyl)-1-[4-(2-fluorop...)
Affinity DataIC50: >1.00E+3nM. Assay description: Evaluated for intracellular calcium mobilization in HEK293 cells transfected to express human vasopressin V1a receptor
In DepthDetails ArticlePubMed
TargetVasopressin V2 receptor(Homo sapiens (Human))
Johnson And Johnson Pharmaceutical Research And Development
Curated by ChEMBL
LigandPNGBDBM50147225(3'N-(2-hexahydro-1-pyridinylethyl)-1-[4-(2-fluorop...)
Affinity DataIC50: >1.00E+3nM. Assay description: Binding affinity measured by inhibition of 3[H] AVP binding to cloned human vasopressin V2 receptor
In DepthDetails ArticlePubMed