BDBM50147422 3-(4-Chloro-1-guanidino-isoquinolin-7-yl)-benzoic acid::CHEMBL111576
SMILES [#7]\[#6](-[#7])=[#7]\c1ncc(Cl)c2ccc(cc12)-c1cccc(c1)-[#6](-[#8])=O
InChI Key InChIKey=UXNWIRHZMHGOCE-UHFFFAOYSA-N
Data  2 KI  1 IC50
  Tab Delimited (TSV)   2D SDfile   Computed 3D by Vconf -m prep SDfile
Find this compound or compounds like it in BindingDB:
Activity Spreadsheet -- Enzyme Inhibition Constant Data from BindingDB
Found 3 hits for monomerid = 50147422
TargetUrokinase-type plasminogen activator(Homo sapiens (Human))
Pfizer
Curated by ChEMBL
LigandPNGBDBM50147422(3-(4-Chloro-1-guanidino-isoquinolin-7-yl)-benzoic ...)
Affinity DataKi:  37nM. Assay description: Inhibitory activity against human urokinase-type plasminogen activator was evaluated using S-2444 as substrate
In DepthDetails ArticlePubMed
TargetUrokinase-type plasminogen activator(Homo sapiens (Human))
Pfizer
Curated by ChEMBL
LigandPNGBDBM50147422(3-(4-Chloro-1-guanidino-isoquinolin-7-yl)-benzoic ...)
Affinity DataKi:  37nM. Assay description: Inhibition of human uPA using S-2444 as substrate
In DepthDetails ArticlePubMed
TargetUrokinase-type plasminogen activator(Homo sapiens (Human))
Pfizer
Curated by ChEMBL
LigandPNGBDBM50147422(3-(4-Chloro-1-guanidino-isoquinolin-7-yl)-benzoic ...)
Affinity DataIC50:  37nM. Assay description: Inhibition of uPA
In DepthDetails ArticlePubMed