BDBM50147619 CHEBI:25567::NITROUS ACID::Nitrite (No2-)
SMILES ON=O
InChI Key InChIKey=IOVCWXUNBOPUCH-UHFFFAOYSA-N
Data  4 KI
  Tab Delimited (TSV)   2D SDfile   Computed 3D by Vconf -m prep SDfile
Find this compound or compounds like it in BindingDB:
Activity Spreadsheet -- Enzyme Inhibition Constant Data from BindingDB
Found 4 hits for monomerid = 50147619
TargetCarbonic anhydrase 1(Homo sapiens (Human))
Universit£
Curated by ChEMBL
LigandPNGBDBM50147619(CHEBI:25567 | NITROUS ACID | Nitrite (No2-))
Affinity DataKi:  8.40E+6nM. Assay description: Inhibition of human carbonic anhydrase 1 preincubated for 15 mins by stopped-flow CO2 hydration assay
In DepthDetails ArticlePubMed
TargetCarbonic anhydrase 1(Homo sapiens (Human))
Universit£
Curated by ChEMBL
LigandPNGBDBM50147619(CHEBI:25567 | NITROUS ACID | Nitrite (No2-))
Affinity DataKi:  8.40E+6nM. Assay description: Inhibition of human CA1 incubated for 15 mins prior to testing by stopped flow CO2 hydrase assay
In DepthDetails ArticlePubMed
TargetCarbonic anhydrase 2(Homo sapiens (Human))
Universit£
Curated by ChEMBL
LigandPNGBDBM50147619(CHEBI:25567 | NITROUS ACID | Nitrite (No2-))
Affinity DataKi:  6.30E+7nM. Assay description: Inhibition of human CA2 incubated for 15 mins prior to testing by stopped flow CO2 hydrase assay
In DepthDetails ArticlePubMed
TargetCarbonic anhydrase 2(Homo sapiens (Human))
Universit£
Curated by ChEMBL
LigandPNGBDBM50147619(CHEBI:25567 | NITROUS ACID | Nitrite (No2-))
Affinity DataKi:  6.30E+7nM. Assay description: Inhibition of human carbonic anhydrase 2 preincubated for 15 mins by stopped-flow CO2 hydration assay
In DepthDetails ArticlePubMed