BDBM50147631 CHEBI:29268::CHEMBL1208163
SMILES OS(=O)(=O)OOS(O)(=O)=O
InChI Key InChIKey=JRKICGRDRMAZLK-UHFFFAOYSA-N
Data  2 KI
  Tab Delimited (TSV)   2D SDfile   Computed 3D by Vconf -m prep SDfile
Find this compound or compounds like it in BindingDB:
Activity Spreadsheet -- Enzyme Inhibition Constant Data from BindingDB
Found 2 hits for monomerid = 50147631
TargetCarbonic anhydrase 2(Homo sapiens (Human))
Universit£
Curated by ChEMBL
LigandPNGBDBM50147631(CHEBI:29268 | CHEMBL1208163)
Affinity DataKi:  8.40E+4nM. Assay description: Inhibition of human carbonic anhydrase 2 preincubated for 15 mins by stopped-flow CO2 hydration assay
In DepthDetails ArticlePubMed
TargetCarbonic anhydrase 1(Homo sapiens (Human))
Universit£
Curated by ChEMBL
LigandPNGBDBM50147631(CHEBI:29268 | CHEMBL1208163)
Affinity DataKi:  1.07E+5nM. Assay description: Inhibition of human carbonic anhydrase 1 preincubated for 15 mins by stopped-flow CO2 hydration assay
In DepthDetails ArticlePubMed