BDBM50147854 3-[(3R,4S)-4-(4-Chloro-phenyl)-1-methyl-piperidin-3-yl]-propan-1-ol::CHEMBL430481
SMILES CN1CC[C@@H]([C@@H](CCCO)C1)c1ccc(Cl)cc1
InChI Key InChIKey=QXYGLYJWXYAGSO-DZGCQCFKSA-N
Data  3 KI
  Tab Delimited (TSV)   2D SDfile   Computed 3D by Vconf -m prep SDfile
Find this compound or compounds like it in BindingDB:
Activity Spreadsheet -- Enzyme Inhibition Constant Data from BindingDB
Found 3 hits for monomerid = 50147854
TargetSodium-dependent dopamine transporter(Rattus norvegicus (rat))
University Of Illinois At Chicago
Curated by ChEMBL
LigandPNGBDBM50147854(3-[(3R,4S)-4-(4-Chloro-phenyl)-1-methyl-piperidin-...)
Affinity DataKi:  16nM. Assay description: Ability to inhibit high affinity uptake of [3H]DA at Dopamine transporter (DAT) using rat brain striatum
In DepthDetails ArticlePubMed
TargetTransporter(Rattus norvegicus)
University Of Illinois At Chicago
Curated by ChEMBL
LigandPNGBDBM50147854(3-[(3R,4S)-4-(4-Chloro-phenyl)-1-methyl-piperidin-...)
Affinity DataKi:  564nM. Assay description: Ability to inhibit high affinity uptake of [3H]NE at Norepinephrine transporter (NET) using rat brain parietal/occipital cortex
In DepthDetails ArticlePubMed
TargetSodium-dependent serotonin transporter(Rattus norvegicus (rat))
University Of Illinois At Chicago
Curated by ChEMBL
LigandPNGBDBM50147854(3-[(3R,4S)-4-(4-Chloro-phenyl)-1-methyl-piperidin-...)
Affinity DataKi:  2.81E+3nM. Assay description: Ability to inhibit high affinity uptake of [3H]-5-HT at Serotonin transporter (SERT) using rat midbrain
In DepthDetails ArticlePubMed