BDBM50148381 4-Iodo-N-[2-((1S,4aR,7S)-1,4a,7-trimethyl-7-vinyl-1,2,3,4,4a,6,7,8,8a,9,10,10a-dodecahydro-phenanthren-1-yl)-acetyl]-benzenesulfonamide::CHEMBL323849
SMILES C[C@@]1(CC=C2C(CCC3[C@](C)(CC(=O)NS(=O)(=O)c4ccc(I)cc4)CCC[C@@]23C)C1)C=C
InChI Key InChIKey=IQHMKFJZOGUQIL-MEVFAHFPSA-N
Data  1 IC50
  Tab Delimited (TSV)   2D SDfile   Computed 3D by Vconf -m prep SDfile
Find this compound or compounds like it in BindingDB:
Activity Spreadsheet -- Enzyme Inhibition Constant Data from BindingDB
Found 1 hit for monomerid = 50148381
TargetProstaglandin G/H synthase 2(Ovis aries (Sheep))
Seoul National University
Curated by ChEMBL
LigandPNGBDBM50148381(4-Iodo-N-[2-((1S,4aR,7S)-1,4a,7-trimethyl-7-vinyl-...)
Affinity DataIC50:  7.22E+4nM. Assay description: In vitro inhibition of Prostaglandin G/H synthase 2 from sheep placental cotyledons
In DepthDetails ArticlePubMed