BDBM50148440 2-{4-[2-(5,6,7,8-Tetrahydro-naphthalen-2-yloxy)-ethoxy]-benzyl}-malonic acid::CHEMBL115463
SMILES OC(=O)C(Cc1ccc(OCCOc2ccc3CCCCc3c2)cc1)C(O)=O
InChI Key InChIKey=IERLBDBFWXMBTP-UHFFFAOYSA-N
Data  2 EC50
  Tab Delimited (TSV)   2D SDfile   Computed 3D by Vconf -m prep SDfile
Find this compound or compounds like it in BindingDB:
Activity Spreadsheet -- Enzyme Inhibition Constant Data from BindingDB
Found 2 hits for monomerid = 50148440
TargetPeroxisome proliferator-activated receptor gamma(Homo sapiens (Human))
Research Institute Of Tsinghua University
Curated by ChEMBL
LigandPNGBDBM50148440(2-{4-[2-(5,6,7,8-Tetrahydro-naphthalen-2-yloxy)-et...)
Affinity DataEC50:  2.11E+3nM. Assay description: In vitro transcription activation on human peroxisome proliferator activated receptor-gamma (PPAR gamma)
In DepthDetails ArticlePubMed
TargetPeroxisome proliferator-activated receptor delta(Homo sapiens (Human))
Research Institute Of Tsinghua University
Curated by ChEMBL
LigandPNGBDBM50148440(2-{4-[2-(5,6,7,8-Tetrahydro-naphthalen-2-yloxy)-et...)
Affinity DataEC50:  4.68E+3nM. Assay description: In vitro transcription activation on human peroxisome proliferator activated receptor-delta (PPAR delta)
In DepthDetails ArticlePubMed