BDBM50148644 3-Aminomethyl-4-(2,4-dichloro-phenyl)-7,8-dimethoxy-5H-indeno[1,2-b]pyridin-2-ylamine::CHEMBL122206
SMILES COc1cc2Cc3c(nc(N)c(CN)c3-c3ccc(Cl)cc3Cl)-c2cc1OC
InChI Key InChIKey=NMMXMFFMHIZMPW-UHFFFAOYSA-N
Data  1 IC50
  Tab Delimited (TSV)   2D SDfile   Computed 3D by Vconf -m prep SDfile
Find this compound or compounds like it in BindingDB:
Activity Spreadsheet -- Enzyme Inhibition Constant Data from BindingDB
Found 1 hit for monomerid = 50148644
TargetDipeptidyl peptidase 4(Homo sapiens (Human))
Bristol-Myers Squibb Research And Development
Curated by ChEMBL
LigandPNGBDBM50148644(3-Aminomethyl-4-(2,4-dichloro-phenyl)-7,8-dimethox...)
Affinity DataIC50:  7nM. Assay description: Inhibition of DPP4
In DepthDetails ArticlePubMed