BDBM50148664 (6-(3-(4-fluorophenyl)-5,6-dihydro-4H-pyrrolo[1,2-b]pyrazol-2-yl)pyridin-2-yl)methanol::CHEMBL122414::{6-[3-(4-Fluoro-phenyl)-5,6-dihydro-4H-pyrrolo[1,2-b]pyrazol-2-yl]-pyridin-2-yl}-methanol
SMILES OCc1cccc(n1)-c1nn2CCCc2c1-c1ccc(F)cc1
InChI Key InChIKey=IKTPHZYFGXICIY-UHFFFAOYSA-N
Data  3 IC50
  Tab Delimited (TSV)   2D SDfile   Computed 3D by Vconf -m prep SDfile
Find this compound or compounds like it in BindingDB:
Activity Spreadsheet -- Enzyme Inhibition Constant Data from BindingDB
Found 3 hits for monomerid = 50148664
TargetThyroid hormone receptor beta(Homo sapiens (Human))
Eli Lilly
Curated by ChEMBL
LigandPNGBDBM50148664((6-(3-(4-fluorophenyl)-5,6-dihydro-4H-pyrrolo[1,2-...)
Affinity DataIC50:  2.62E+3nM. Assay description: Inhibitory activity against TGF-beta type I receptor
In DepthDetails ArticlePubMed
TargetTGF-beta receptor type-1(Homo sapiens (Human))
Sichuan University
Curated by ChEMBL
LigandPNGBDBM50148664((6-(3-(4-fluorophenyl)-5,6-dihydro-4H-pyrrolo[1,2-...)
Affinity DataIC50:  2.62E+3nM. Assay description: Inhibition of TGFR1
In DepthDetails ArticlePubMed
TargetMitogen-activated protein kinase 14(Homo sapiens (Human))
Eli Lilly
Curated by ChEMBL
LigandPNGBDBM50148664((6-(3-(4-fluorophenyl)-5,6-dihydro-4H-pyrrolo[1,2-...)
Affinity DataIC50: >2.00E+4nM. Assay description: Inhibitory activity against Mitogen-activated protein kinase p38
In DepthDetails ArticlePubMed