BDBM50148675 Allyl-[1-((3R,5S)-5-benzenesulfonyl-3-phenyl-hexyl)-piperidin-4-yl]-carbamic acid 4-nitro-benzyl ester::CHEMBL120204
SMILES C[C@@H](C[C@@H](CCN1CCC(CC1)N(CC=C)C(=O)OCc1ccc(cc1)[N+]([O-])=O)c1ccccc1)S(=O)(=O)c1ccccc1
InChI Key InChIKey=MEGVWTLKRYCWEG-BHBYDHKZSA-N
Data  1 IC50
  Tab Delimited (TSV)   2D SDfile   Computed 3D by Vconf -m prep SDfile
Find this compound or compounds like it in BindingDB:
Activity Spreadsheet -- Enzyme Inhibition Constant Data from BindingDB
Found 1 hit for monomerid = 50148675
TargetC-C chemokine receptor type 5(Homo sapiens (Human))
Merck Research Laboratories
Curated by ChEMBL
LigandPNGBDBM50148675(Allyl-[1-((3R,5S)-5-benzenesulfonyl-3-phenyl-hexyl...)
Affinity DataIC50:  1.04E+4nM. Assay description: Concentration required to inhibit [125I]-MIP-1 alpha binding to C-C chemokine receptor type 5
In DepthDetails ArticlePubMed