BDBM50148825 CHEMBL3770860
SMILES CC(Sc1nc(C)cc(C)n1)C(=O)Nc1ncc(Cc2ccc(cc2)-c2ccccc2)s1
InChI Key InChIKey=RHQUGGUHFWCOLB-UHFFFAOYSA-N
Data  1 IC50
  Tab Delimited (TSV)   2D SDfile   Computed 3D by Vconf -m prep SDfile
Find this compound or compounds like it in BindingDB:
Activity Spreadsheet -- Enzyme Inhibition Constant Data from BindingDB
Found 1 hit for monomerid = 50148825
TargetNAD-dependent protein deacetylase sirtuin-2(Homo sapiens (Human))
Albert-Ludwigs-University Of Freiburg
Curated by ChEMBL
LigandPNGBDBM50148825(CHEMBL3770860)
Affinity DataIC50:  3.30E+4nM. Assay description: Inhibition of N-terminal his6-tagged human SIRT2 (25 to 389 amino acids) using ZMAL as substrate after 4 hrs by fluorescence-based microplate reader ...
In DepthDetails ArticlePubMed