BDBM50149111 5-Butyl-2-(4-chloro-phenyl)-[1,2,4]triazolo[1,5-c]quinazoline::CHEMBL339529
SMILES CCCCc1nc2ccccc2c2nc(nn12)-c1ccc(Cl)cc1
InChI Key InChIKey=RRVQUSBAKWVBSF-UHFFFAOYSA-N
Data  4 IC50
  Tab Delimited (TSV)   2D SDfile   Computed 3D by Vconf -m prep SDfile
Find this compound or compounds like it in BindingDB:
Activity Spreadsheet -- Enzyme Inhibition Constant Data from BindingDB
Found 4 hits for monomerid = 50149111
TargetAdenosine receptor A3(Homo sapiens (Human))
Otsuka Pharmaceutical Factory
Curated by ChEMBL
LigandPNGBDBM50149111(5-Butyl-2-(4-chloro-phenyl)-[1,2,4]triazolo[1,5-c]...)
Affinity DataIC50:  26nM. Assay description: Displacement of specific [125I]-AB-MECA binding at human adenosine A3 receptor expressed in HEK-293 cells
In DepthDetails ArticlePubMed
TargetAdenosine receptor A2b(Homo sapiens (Human))
Otsuka Pharmaceutical Factory
Curated by ChEMBL
LigandPNGBDBM50149111(5-Butyl-2-(4-chloro-phenyl)-[1,2,4]triazolo[1,5-c]...)
Affinity DataIC50: >1.00E+4nM. Assay description: Displacement of specific [3H]-DPCPX binding at human adenosine A2B receptor expressed in HEK-293 cells.
In DepthDetails ArticlePubMed
TargetAdenosine receptor A1(Homo sapiens (Human))
Otsuka Pharmaceutical Factory
Curated by ChEMBL
LigandPNGBDBM50149111(5-Butyl-2-(4-chloro-phenyl)-[1,2,4]triazolo[1,5-c]...)
Affinity DataIC50: >1.00E+4nM. Assay description: Displacement of specific [3H]-DPCPX binding at human adenosine A1 receptor expressed in CHO cells.
In DepthDetails ArticlePubMed
TargetAdenosine receptor A2a(Homo sapiens (Human))
Otsuka Pharmaceutical Factory
Curated by ChEMBL
LigandPNGBDBM50149111(5-Butyl-2-(4-chloro-phenyl)-[1,2,4]triazolo[1,5-c]...)
Affinity DataIC50: >1.00E+4nM. Assay description: Displacement of specific [3H]-CGS- 21680 binding at human adenosine A2A receptor expressed in HEK-293 cells
In DepthDetails ArticlePubMed