BDBM50149125 5-Butyl-8-chloro-2-(4-chloro-phenyl)-[1,2,4]triazolo[1,5-c]quinazoline::CHEMBL338837
SMILES CCCCc1nc2cc(Cl)ccc2c2nc(nn12)-c1ccc(Cl)cc1
InChI Key InChIKey=UAEQEDBUYPTJIP-UHFFFAOYSA-N
Data  2 IC50
  Tab Delimited (TSV)   2D SDfile   Computed 3D by Vconf -m prep SDfile
Find this compound or compounds like it in BindingDB:
Activity Spreadsheet -- Enzyme Inhibition Constant Data from BindingDB
Found 2 hits for monomerid = 50149125
TargetAdenosine receptor A3(Homo sapiens (Human))
Otsuka Pharmaceutical Factory
Curated by ChEMBL
LigandPNGBDBM50149125(5-Butyl-8-chloro-2-(4-chloro-phenyl)-[1,2,4]triazo...)
Affinity DataIC50:  320nM. Assay description: Displacement of specific [125I]-AB-MECA binding at human adenosine A3 receptor expressed in HEK-293 cells
In DepthDetails ArticlePubMed
TargetAdenosine receptor A2a(Homo sapiens (Human))
Otsuka Pharmaceutical Factory
Curated by ChEMBL
LigandPNGBDBM50149125(5-Butyl-8-chloro-2-(4-chloro-phenyl)-[1,2,4]triazo...)
Affinity DataIC50: >1.00E+4nM. Assay description: Displacement of specific [3H]-CGS- 21680 binding at human adenosine A2A receptor expressed in HEK-293 cells
In DepthDetails ArticlePubMed