BDBM50149357 2-(4-Methoxy-phenyl)-6-nitro-2H,5H-[1,2,4]triazolo[4,3-a]quinoxaline-1,4-dione::2-(4-methoxyphenyl)-6-nitro-[1,2,4]triazolo[4,3-a]quinoxaline-1,4(2H,5H)-dione::CHEMBL333799
SMILES COc1ccc(cc1)-n1nc2n(c3cccc([N+]([O-])=O)c3[nH]c2=O)c1=O
InChI Key InChIKey=UGJOYDSLQDTUGS-UHFFFAOYSA-N
Data  5 KI
  Tab Delimited (TSV)   2D SDfile   Computed 3D by Vconf -m prep SDfile
Find this compound or compounds like it in BindingDB:
Activity Spreadsheet -- Enzyme Inhibition Constant Data from BindingDB
Found 5 hits for monomerid = 50149357
TargetAdenosine receptor A3(Homo sapiens (Human))
Universita Di Firenze
Curated by ChEMBL
LigandPNGBDBM50149357(2-(4-Methoxy-phenyl)-6-nitro-2H,5H-[1,2,4]triazolo...)
Affinity DataKi:  4.70nM. Assay description: Displacement of [125I]AB-MECA from human cloned adenosine A3 receptor expressed in CHO cells
In DepthDetails ArticlePubMed
TargetAdenosine receptor A3(Homo sapiens (Human))
Universita Di Firenze
Curated by ChEMBL
LigandPNGBDBM50149357(2-(4-Methoxy-phenyl)-6-nitro-2H,5H-[1,2,4]triazolo...)
Affinity DataKi:  4.70nM. Assay description: Binding affinity against human adenosine A3 receptor expressed in CHO cells by [125I]AB-MECA displacement.
In DepthDetails ArticlePubMed
TargetAdenosine receptor A3(Homo sapiens (Human))
Universita Di Firenze
Curated by ChEMBL
LigandPNGBDBM50149357(2-(4-Methoxy-phenyl)-6-nitro-2H,5H-[1,2,4]triazolo...)
Affinity DataKi:  4.70nM. Assay description: Displacement of [125I]I-AB-MECA from human recombinant adenosine A3 receptor expressed in CHO cells after 60 mins by gamma counter
In DepthDetails ArticlePubMed
TargetAdenosine receptor A1(Homo sapiens (Human))
Universit£
Curated by ChEMBL
LigandPNGBDBM50149357(2-(4-Methoxy-phenyl)-6-nitro-2H,5H-[1,2,4]triazolo...)
Affinity DataKi: >1.00E+4nM. Assay description: Displacement of [3H]CCPA from human recombinant adenosine A1 receptor expressed in CHO cells after 60 mins by gamma counter
In DepthDetails ArticlePubMed
TargetAdenosine receptor A3(Homo sapiens (Human))
Universita Di Firenze
Curated by ChEMBL
LigandPNGBDBM50149357(2-(4-Methoxy-phenyl)-6-nitro-2H,5H-[1,2,4]triazolo...)
Affinity DataKi:  5.33E+6nM. Assay description: Displacement of specific [125I]AB-MECA binding at human Adenosine A3 receptor expressed in CHO cells
In DepthDetails ArticlePubMed