BDBM50149427 2-methyl-4-[9-(6-methyl-2-pyridylmethoxy)-4,5,7,8-tetraazatetracyclo[9.2.2.02,10.03,7]pentadeca-2(10),3,5,8-tetraen-6-yl]-1,3-oxazole::CHEMBL123530
SMILES Cc1nc(co1)-c1nnc2c3C4CCC(CC4)c3c(OCc3cccc(C)n3)nn12
InChI Key InChIKey=MGVMCBAQXDZWTN-UHFFFAOYSA-N
Data  4 KI
  Tab Delimited (TSV)   2D SDfile   Computed 3D by Vconf -m prep SDfile
Find this compound or compounds like it in BindingDB:
Activity Spreadsheet -- Enzyme Inhibition Constant Data from BindingDB
Found 4 hits for monomerid = 50149427
TargetGABA-A receptor; alpha-5/beta-3/gamma-2(Homo sapiens (Human))
Merck Sharp And Dohme Research Laboratories
Curated by ChEMBL
LigandPNGBDBM50149427(2-methyl-4-[9-(6-methyl-2-pyridylmethoxy)-4,5,7,8-...)
Affinity DataKi:  6.80nM. Assay description: Binding affinity towards human alpha5-beta3-gamma2 GABA-A receptor using [3H]-Ro-15-1788 expressed in L(tk-) cells
In DepthDetails ArticlePubMed
TargetGamma-aminobutyric acid receptor subunit alpha-3/beta-3/gamma-2(Homo sapiens (Human))
Merck Sharp And Dohme Research Laboratories
Curated by ChEMBL
LigandPNGBDBM50149427(2-methyl-4-[9-(6-methyl-2-pyridylmethoxy)-4,5,7,8-...)
Affinity DataKi:  46nM. Assay description: Binding affinity towards human gamma-aminobutyric-acid A receptor alpha3-beta3-gamma2 using [3H]-Ro-15-1788 expressed in L(tk-) cells
In DepthDetails ArticlePubMed
TargetGABA-A receptor; alpha-2/beta-3/gamma-2(Homo sapiens (Human))
Merck Sharp And Dohme Research Laboratories
Curated by ChEMBL
LigandPNGBDBM50149427(2-methyl-4-[9-(6-methyl-2-pyridylmethoxy)-4,5,7,8-...)
Affinity DataKi:  57nM. Assay description: Binding affinity towards human gamma-aminobutyric-acid A receptor alpha2-beta3-gamma2 using [3H]-Ro-15-1788 expressed in L(tk-) cells
In DepthDetails ArticlePubMed
TargetGamma-aminobutyric acid receptor subunit alpha-1/beta-3/gamma-2(Homo sapiens (Human))
Merck Sharp And Dohme Research Laboratories
Curated by ChEMBL
LigandPNGBDBM50149427(2-methyl-4-[9-(6-methyl-2-pyridylmethoxy)-4,5,7,8-...)
Affinity DataKi:  280nM. Assay description: Binding affinity towards human alpha1-beta3-gamma2 GABA-A receptor using [3H]-Ro-15-1788 expressed in L(tk-) cells
Target InfoGoogleScholar
In DepthDetails ArticlePubMed