BDBM50149507 (2S,3R)-2-{4-[2-(2-(R)-1-Hydroxymethyl-pyrrolidin-1-yl)-ethoxy]-phenyl}-3-(4-hydroxy-phenyl)-2,3-dihydro-benzo[1,4]oxathiin-6-ol::CHEMBL360802
SMILES OC[C@H]1CCCN1CCOc1ccc(cc1)[C@@H]1Oc2ccc(O)cc2S[C@@H]1c1ccc(O)cc1
InChI Key InChIKey=CEFNIUUIIQIRMU-JAMKYWPSSA-N
Data  2 IC50
  Tab Delimited (TSV)   2D SDfile   Computed 3D by Vconf -m prep SDfile
Find this compound or compounds like it in BindingDB:
Activity Spreadsheet -- Enzyme Inhibition Constant Data from BindingDB
Found 2 hits for monomerid = 50149507
TargetEstrogen receptor beta(Homo sapiens (Human))
Merck Research Laboratories
Curated by ChEMBL
LigandPNGBDBM50149507((2S,3R)-2-{4-[2-(2-(R)-1-Hydroxymethyl-pyrrolidin-...)
Affinity DataIC50:  134nM. Assay description: Binding potency for human ER beta
In DepthDetails ArticlePubMed
TargetEstrogen receptor(Homo sapiens (Human))
Merck Research Laboratories
Curated by ChEMBL
LigandPNGBDBM50149507((2S,3R)-2-{4-[2-(2-(R)-1-Hydroxymethyl-pyrrolidin-...)
Affinity DataIC50:  2nM. Assay description: Binding potency for human ER alpha
In DepthDetails ArticlePubMed