BDBM50149547 4-[(4-Hydroxy-phenylcarbamoyl)-methoxy]-naphthalene-1-carboxylic acid (3-fluoro-phenyl)-amide::CHEMBL182765
SMILES Oc1ccc(NC(=O)COc2ccc(C(=O)Nc3cccc(F)c3)c3ccccc23)cc1
InChI Key InChIKey=YZHFFFVVOANGLQ-UHFFFAOYSA-N
Data  2 IC50
  Tab Delimited (TSV)   2D SDfile   Computed 3D by Vconf -m prep SDfile
Find this compound or compounds like it in BindingDB:
Activity Spreadsheet -- Enzyme Inhibition Constant Data from BindingDB
Found 2 hits for monomerid = 50149547
TargetPOU domain, class 3, transcription factor 3(Homo sapiens (Human))
The State University Of New York
Curated by ChEMBL
LigandPNGBDBM50149547(4-[(4-Hydroxy-phenylcarbamoyl)-methoxy]-naphthalen...)
Affinity DataIC50:  1.24E+5nM. Assay description: Antagonistic activity against BRN1/DNA interaction by electrophoretic mobility shift assay
In DepthDetails ArticlePubMed
TargetPOU domain, class 3, transcription factor 2(Homo sapiens (Human))
The State University Of New York
Curated by ChEMBL
LigandPNGBDBM50149547(4-[(4-Hydroxy-phenylcarbamoyl)-methoxy]-naphthalen...)
Affinity DataIC50:  1.38E+5nM. Assay description: Antagonistic activity against BRN2/DNA interaction by electrophoretic mobility shift assay
In DepthDetails ArticlePubMed