BDBM50149594 CHEMBL3771208
SMILES OC[C@H]1O[C@H]([C@H](O)[C@@H]1O)n1cnc2c(N[C@@H]3CCC[C@H]3OCc3ccccc3)ncnc12
InChI Key InChIKey=XSVRBMOJKPAIJX-NKYRPOHVSA-N
Data  6 KI  1 IC50  2 Kd  3 EC50
  Tab Delimited (TSV)   2D SDfile   Computed 3D by Vconf -m prep SDfile
Find this compound or compounds like it in BindingDB:
Activity Spreadsheet -- Enzyme Inhibition Constant Data from BindingDB
Found 12 hits for monomerid = 50149594
TargetAdenosine receptor A1(Homo sapiens (Human))
University Of Bern
Curated by ChEMBL
LigandPNGBDBM50149594(CHEMBL3771208)
Affinity DataKi:  117nM. Assay description: Inhibition of CA200645 binding to NanoLuc-fused human adenosine A1 receptor T257 6.58A mutant expressed in HEK293 cells measured at 10 mins by NanoBR...
In DepthDetails PubMed
TargetAdenosine receptor A1(Rattus norvegicus (rat))
University Of Bern
Curated by ChEMBL
LigandPNGBDBM50149594(CHEMBL3771208)
Affinity DataKi:  389nM. Assay description: Inhibition of CA200645 binding to NanoLuc-fused rat adenosine A1 receptor expressed in HEK293 cells measured for 10 mins by NanoBRET competition bind...
In DepthDetails PubMed
TargetAdenosine receptor A1(Homo sapiens (Human))
University Of Bern
Curated by ChEMBL
LigandPNGBDBM50149594(CHEMBL3771208)
Affinity DataKi:  575nM. Assay description: Inhibition of CA200645 binding to wild type NanoLuc-fused human adenosine A1 receptor expressed in HEK293 cells measured at 10 mins by NanoBRET compe...
In DepthDetails PubMed
TargetAdenosine receptor A1(Homo sapiens (Human))
University Of Bern
Curated by ChEMBL
LigandPNGBDBM50149594(CHEMBL3771208)
Affinity DataKi:  661nM. Assay description: Inhibition of CA200645 binding to NanoLuc-fused human adenosine A1 receptor expressed in HEK293 cells measured for 10 mins by NanoBRET competition bi...
In DepthDetails PubMed
TargetAdenosine receptor A1(Homo sapiens (Human))
University Of Bern
Curated by ChEMBL
LigandPNGBDBM50149594(CHEMBL3771208)
Affinity DataKi:  977nM. Assay description: Inhibition of CA200645 binding to NanoLuc-fused human adenosine A1 receptor N70 2.65A mutant expressed in HEK293 cells measured at 10 mins by NanoBRE...
In DepthDetails PubMed
TargetAdenosine receptor A1(Homo sapiens (Human))
University Of Bern
Curated by ChEMBL
LigandPNGBDBM50149594(CHEMBL3771208)
Affinity DataKi:  9.33E+3nM. Assay description: Inhibition of CA200645 binding to NanoLuc-fused human adenosine A1 receptor I69 2.64A mutant expressed in HEK293 cells measured at 10 mins by NanoBRE...
In DepthDetails PubMed
TargetAdenosine receptor A1(Rattus norvegicus (rat))
University Of Bern
Curated by ChEMBL
LigandPNGBDBM50149594(CHEMBL3771208)
Affinity DataKd:  398nM. Assay description: Inhibition of CA200645 binding to NanoLuc-fused rat adenosine A1 receptor expressed in HEK293 cells assessed as kinetic dissociation constant by Nano...
In DepthDetails PubMed
TargetAdenosine receptor A1(Homo sapiens (Human))
University Of Bern
Curated by ChEMBL
LigandPNGBDBM50149594(CHEMBL3771208)
Affinity DataIC50:  0.676nM. Assay description: Agonist activity at human Adenosine A1 receptor transfected in CHO-K1 cells assessed as inhibition of forskolin-stimulated cAMP production after 30 m...
In DepthDetails ArticlePubMed
TargetAdenosine receptor A1(Homo sapiens (Human))
University Of Bern
Curated by ChEMBL
LigandPNGBDBM50149594(CHEMBL3771208)
Affinity DataEC50:  1.59E+3nM. Assay description: Agonist activity at human Adenosine A1 receptor expressed in yeast cells coexpressed with chimeric GPA1/Galphai1 after 16 hrs by beta galactosidase r...
In DepthDetails ArticlePubMed
TargetAdenosine receptor A2a(Homo sapiens (Human))
University Of Bern
Curated by ChEMBL
LigandPNGBDBM50149594(CHEMBL3771208)
Affinity DataEC50:  1.12E+4nM. Assay description: Agonist activity at human adenosine A2A receptor expressed in CHO-K1 cells assessed as inhibition of forskolin-induced cAMP accumulation incubated fo...
In DepthDetails PubMed
TargetAdenosine receptor A1(Homo sapiens (Human))
University Of Bern
Curated by ChEMBL
LigandPNGBDBM50149594(CHEMBL3771208)
Affinity DataEC50:  3.70nM. Assay description: Agonist activity at human adenosine A1 receptor expressed in CHO-K1 cells assessed as inhibition of forskolin-induced cAMP accumulation incubated for...
In DepthDetails PubMed
TargetAdenosine receptor A1(Homo sapiens (Human))
University Of Bern
Curated by ChEMBL
LigandPNGBDBM50149594(CHEMBL3771208)
Affinity DataKd:  501nM. Assay description: Inhibition of CA200645 binding to NanoLuc-fused human adenosine A1 receptor expressed in HEK293 cells assessed as kinetic dissociation constant by Na...
In DepthDetails PubMed