BDBM50149666 CHEMBL181812::[2,5-Dimethyl-3-(3-methyl-5-methylamino-pyridin-2-yl)-pyrazolo[1,5-a]pyrimidin-7-yl]-dipropyl-amine
SMILES CCCN(CCC)c1cc(C)nc2c(c(C)nn12)-c1ncc(NC)cc1C
InChI Key InChIKey=FPSACPHQDKIKRT-UHFFFAOYSA-N
Data  1 KI
  Tab Delimited (TSV)   2D SDfile   Computed 3D by Vconf -m prep SDfile
Find this compound or compounds like it in BindingDB:
Activity Spreadsheet -- Enzyme Inhibition Constant Data from BindingDB
Found 1 hit for monomerid = 50149666
TargetCorticotropin-releasing factor receptor 1(Homo sapiens (Human))
Neurocrine Biosciences
Curated by ChEMBL
LigandPNGBDBM50149666(CHEMBL181812 | [2,5-Dimethyl-3-(3-methyl-5-methyla...)
Affinity DataKi:  40nM. Assay description: Binding affinity for recombinant human CRF1 receptor
In DepthDetails ArticlePubMed