BDBM50149683 CHEMBL180142::[3-(3,5-Dichloro-pyridin-2-yl)-2,5-dimethyl-pyrazolo[1,5-a]pyrimidin-7-yl]-(2-methoxy-ethyl)-propyl-amine
SMILES CCCN(CCOC)c1cc(C)nc2c(c(C)nn12)-c1ncc(Cl)cc1Cl
InChI Key InChIKey=YRXZSJYELHYWAS-UHFFFAOYSA-N
Data  1 KI
  Tab Delimited (TSV)   2D SDfile   Computed 3D by Vconf -m prep SDfile
Find this compound or compounds like it in BindingDB:
Activity Spreadsheet -- Enzyme Inhibition Constant Data from BindingDB
Found 1 hit for monomerid = 50149683
TargetCorticotropin-releasing factor receptor 1(Homo sapiens (Human))
Neurocrine Biosciences
Curated by ChEMBL
LigandPNGBDBM50149683(CHEMBL180142 | [3-(3,5-Dichloro-pyridin-2-yl)-2,5-...)
Affinity DataKi:  3.20nM. Assay description: Binding affinity for recombinant human CRF1 receptor
In DepthDetails ArticlePubMed