BDBM50149703 CHEMBL3770438
SMILES Cc1cc(C)c(CNC(=O)c2cc(Br)nc3n(ncc23)C2CCCC2)c(=O)[nH]1
InChI Key InChIKey=GHQYFCSBPMVBAC-UHFFFAOYSA-N
Data  1 IC50
  Tab Delimited (TSV)   2D SDfile   Computed 3D by Vconf -m prep SDfile
Find this compound or compounds like it in BindingDB:
Activity Spreadsheet -- Enzyme Inhibition Constant Data from BindingDB
Found 1 hit for monomerid = 50149703
TargetHistone-lysine N-methyltransferase EZH2(Homo sapiens (Human))
Epizyme
Curated by ChEMBL
LigandPNGBDBM50149703(CHEMBL3770438)
Affinity DataIC50:  80nM. Assay description: Inhibition of methyltransferase activity of human EZH2 using chicken oligonucleotide as substrate by pull down assay
In DepthDetails ArticlePubMed