BDBM50149720 (3S,3aR,4R,4aS,8aR,9aS)-4-[(E)-2-((2S,6S)-1,6-Dimethyl-piperidin-2-yl)-vinyl]-3-methyl-decahydro-naphtho[2,3-c]furan-1-one::CHEMBL433566
SMILES C[C@@H]1OC(=O)[C@H]2C[C@H]3CCCC[C@@H]3[C@@H](\C=C\[C@@H]3CCC[C@H](C)N3C)[C@@H]12
InChI Key InChIKey=FMPNFDSPHNUFOS-HQEQRHKESA-N
Data  2 KI
  Tab Delimited (TSV)   2D SDfile   Computed 3D by Vconf -m prep SDfile
Find this compound or compounds like it in BindingDB:
Activity Spreadsheet -- Enzyme Inhibition Constant Data from BindingDB
Found 2 hits for monomerid = 50149720
TargetMuscarinic acetylcholine receptor M1(Homo sapiens (Human))
Schering-Plough Research Institute
Curated by ChEMBL
LigandPNGBDBM50149720((3S,3aR,4R,4aS,8aR,9aS)-4-[(E)-2-((2S,6S)-1,6-Dime...)
Affinity DataKi: >1.40E+3nM. Assay description: In vitro inhibitory activity against cloned human M1 muscarinic receptor
In DepthDetails ArticlePubMed
TargetMuscarinic acetylcholine receptor M2(Homo sapiens (Human))
Schering-Plough Research Institute
Curated by ChEMBL
LigandPNGBDBM50149720((3S,3aR,4R,4aS,8aR,9aS)-4-[(E)-2-((2S,6S)-1,6-Dime...)
Affinity DataKi: >1.40E+3nM. Assay description: In vitro inhibitory activity against cloned human M2 muscarinic receptor
In DepthDetails ArticlePubMed