BDBM50149763 CHEMBL182172::{4-Oxo-5-[1-[4-((S)-2-phenyl-propoxy)-3-((S)-2,2,2-trifluoro-1-phenyl-ethoxy)-phenyl]-meth-(Z)-ylidene]-2-thioxo-thiazolidin-3-yl}-acetic acid
SMILES C[C@H](COc1ccc(\C=C2/SC(=S)N(CC(O)=O)C2=O)cc1O[C@@H](c1ccccc1)C(F)(F)F)c1ccccc1
InChI Key InChIKey=LHYRKNFTTKMDNQ-WQFLCVAXSA-N
Data  1 IC50
  Tab Delimited (TSV)   2D SDfile   Computed 3D by Vconf -m prep SDfile
Find this compound or compounds like it in BindingDB:
Activity Spreadsheet -- Enzyme Inhibition Constant Data from BindingDB
Found 1 hit for monomerid = 50149763
TargetDolichyl-phosphate-mannose--protein mannosyltransferase 1(Candida albicans)
Celltech R&D
Curated by ChEMBL
LigandPNGBDBM50149763(CHEMBL182172 | {4-Oxo-5-[1-[4-((S)-2-phenyl-propox...)
Affinity DataIC50:  3.50E+3nM. Assay description: In vitro inhibition of Candida albicans protein mannosyl transferase 1
In DepthDetails ArticlePubMed