BDBM50149794 5''-(2-Methyl-thiazol-4-ylethynyl)-[2,3'']bipyridinyl::CHEMBL183230
SMILES Cc1nc(cs1)C#Cc1cncc(c1)-c1ccccn1
InChI Key InChIKey=XUWOPDSTCQMYBU-UHFFFAOYSA-N
Data  1 KI  1 IC50
  Tab Delimited (TSV)   2D SDfile   Computed 3D by Vconf -m prep SDfile
Find this compound or compounds like it in BindingDB:
Activity Spreadsheet -- Enzyme Inhibition Constant Data from BindingDB
Found 2 hits for monomerid = 50149794
TargetMetabotropic glutamate receptor 5(Rattus norvegicus (Rat))
Merck Research Laboratories
Curated by ChEMBL
LigandPNGBDBM50149794(5''-(2-Methyl-thiazol-4-ylethynyl)-[2,3'']bipyridi...)
Affinity DataKi:  28nM. Assay description: Displacement by compound of [3H]-3-methoxy-5-(pyridin-2-ylethynyl)pyridine from rat cortical membranes
In DepthDetails ArticlePubMed
TargetMetabotropic glutamate receptor 5(Homo sapiens (Human))
Merck Research Laboratories
Curated by ChEMBL
LigandPNGBDBM50149794(5''-(2-Methyl-thiazol-4-ylethynyl)-[2,3'']bipyridi...)
Affinity DataIC50:  22nM. Assay description: In vitro potency against human recombinant mGlu5 receptor was determined by [Ca2+] flux assay using glutamate as agonist
In DepthDetails ArticlePubMed