BDBM50149795 5-(2-Methyl-thiazol-4-ylethynyl)-[2,4'']bipyridinyl::CHEMBL181411
SMILES Cc1nc(cs1)C#Cc1ccc(nc1)-c1ccncc1
InChI Key InChIKey=YGFYDAOIGCRBFD-UHFFFAOYSA-N
Data  1 KI  1 IC50
  Tab Delimited (TSV)   2D SDfile   Computed 3D by Vconf -m prep SDfile
Find this compound or compounds like it in BindingDB:
Activity Spreadsheet -- Enzyme Inhibition Constant Data from BindingDB
Found 2 hits for monomerid = 50149795
TargetMetabotropic glutamate receptor 5(Rattus norvegicus (Rat))
Merck Research Laboratories
Curated by ChEMBL
LigandPNGBDBM50149795(5-(2-Methyl-thiazol-4-ylethynyl)-[2,4'']bipyridiny...)
Affinity DataKi:  21nM. Assay description: Displacement by compound of [3H]-3-methoxy-5-(pyridin-2-ylethynyl)pyridine from rat cortical membranes
In DepthDetails ArticlePubMed
TargetMetabotropic glutamate receptor 5(Homo sapiens (Human))
Merck Research Laboratories
Curated by ChEMBL
LigandPNGBDBM50149795(5-(2-Methyl-thiazol-4-ylethynyl)-[2,4'']bipyridiny...)
Affinity DataIC50:  29nM. Assay description: In vitro potency against human recombinant mGlu5 receptor was determined by [Ca2+] flux assay using glutamate as agonist
In DepthDetails ArticlePubMed