BDBM50150003 CHEMBL360928::Phosphoric acid mono-[(R)-3-[4-(4-methoxy-quinolin-2-ylmethoxy)-phenyl]-2-((Z)-octadec-9-enoylamino)-propyl] ester
SMILES CCCCCCCC\C=C/CCCCCCCC(=O)N[C@@H](COP(O)(O)=O)Cc1ccc(OCc2cc(OC)c3ccccc3n2)cc1
InChI Key InChIKey=OBGQDUHQIDGZKM-VBIORDRPSA-N
Data  1 KI  1 IC50
  Tab Delimited (TSV)   2D SDfile   Computed 3D by Vconf -m prep SDfile
Find this compound or compounds like it in BindingDB:
Activity Spreadsheet -- Enzyme Inhibition Constant Data from BindingDB
Found 2 hits for monomerid = 50150003
TargetLysophosphatidic acid receptor 3(Homo sapiens (Human))
University Of Virginia
Curated by ChEMBL
LigandPNGBDBM50150003(CHEMBL360928 | Phosphoric acid mono-[(R)-3-[4-(4-m...)
Affinity DataKi:  1.16E+3nM. Assay description: Binding affinity towards Lysophosphatidic acid 3 (LPA3) receptor
In DepthDetails ArticlePubMed
TargetLysophosphatidic acid receptor 1(Homo sapiens (Human))
University Of Virginia
Curated by ChEMBL
LigandPNGBDBM50150003(CHEMBL360928 | Phosphoric acid mono-[(R)-3-[4-(4-m...)
Affinity DataIC50:  962nM. Assay description: Inhibitory concentration against Lysophosphatidic acid 1 (LPA1) receptor
In DepthDetails ArticlePubMed