BDBM50150008 CHEMBL182773::[4-[4-(4-Methoxy-3,5-dimethyl-pyridin-2-ylmethoxy)-phenyl]-3-((Z)-(R)-octadec-9-enoylamino)-butyl]-phosphonic acid
SMILES CCCCCCCC\C=C/CCCCCCCC(=O)N[C@@H](CCP(O)(O)=O)Cc1ccc(OCc2ncc(C)c(OC)c2C)cc1
InChI Key InChIKey=WDOSFOOESMCPNR-DEAWDCQTSA-N
Data  1 KI  1 IC50
  Tab Delimited (TSV)   2D SDfile   Computed 3D by Vconf -m prep SDfile
Find this compound or compounds like it in BindingDB:
Activity Spreadsheet -- Enzyme Inhibition Constant Data from BindingDB
Found 2 hits for monomerid = 50150008
TargetLysophosphatidic acid receptor 3(Homo sapiens (Human))
University Of Virginia
Curated by ChEMBL
LigandPNGBDBM50150008(CHEMBL182773 | [4-[4-(4-Methoxy-3,5-dimethyl-pyrid...)
Affinity DataKi:  150nM. Assay description: Binding affinity towards Lysophosphatidic acid 3 (LPA3) receptor
In DepthDetails ArticlePubMed
TargetLysophosphatidic acid receptor 1(Homo sapiens (Human))
University Of Virginia
Curated by ChEMBL
LigandPNGBDBM50150008(CHEMBL182773 | [4-[4-(4-Methoxy-3,5-dimethyl-pyrid...)
Affinity DataIC50: >1.00E+4nM. Assay description: Inhibitory concentration against Lysophosphatidic acid 1 (LPA1) receptor
In DepthDetails ArticlePubMed