BDBM50150109 CHEMBL3770355
SMILES O=C(Cc1ccccc1)Nc1nnc(N[C@@H]2CCN(C2)c2nnc(NC(=O)Cc3ccccc3)s2)s1
InChI Key InChIKey=XKAUHJUBYCZSGD-GOSISDBHSA-N
Data  3 IC50
PDB links: 2 PDB IDs match this monomer.
  Tab Delimited (TSV)   2D SDfile   Computed 3D by Vconf -m prep SDfile
Find this compound or compounds like it in BindingDB:
Activity Spreadsheet -- Enzyme Inhibition Constant Data from BindingDB
Found 3 hits for monomerid = 50150109
TargetGlutaminase kidney isoform, mitochondrial(Homo sapiens (Human))
University Of Pittsburgh
Curated by ChEMBL
LigandPNGBDBM50150109(CHEMBL3770355)
Affinity DataIC50:  30nM. Assay description: Inhibition of recombinant HIs-tagged human GAC (residue 72-603 aa) expressed in Escherichia coli after 10 mins using glutamine as substrate
TargetGlutaminase liver isoform, mitochondrial(Homo sapiens)
Astrazeneca
Curated by ChEMBL
LigandPNGBDBM50150109(CHEMBL3770355)
Affinity DataIC50: >4.00E+4nM. Assay description: Inhibition of GLS2 (unknown origin)
In DepthDetails ArticlePubMed
TargetGlutaminase kidney isoform, mitochondrial(Homo sapiens (Human))
University Of Pittsburgh
Curated by ChEMBL
LigandPNGBDBM50150109(CHEMBL3770355)
Affinity DataIC50:  14nM. Assay description: Inhibition of recombinant 6His-tagged GLS1 KGA isoform (unknown origin) (63 to 669 residues) expressed in Escherichia coli using glutamine as substra...