BDBM50150526 2-(3-Bromo-phenylamino)-4-methyl-pentanoic acid cyanomethyl-amide::CHEMBL184788
SMILES CC(C)CC(Nc1cccc(Br)c1)C(=O)NCC#N
InChI Key InChIKey=JKPUQGOMILKMTN-UHFFFAOYSA-N
Data  1 IC50
  Tab Delimited (TSV)   2D SDfile   Computed 3D by Vconf -m prep SDfile
Find this compound or compounds like it in BindingDB:
Activity Spreadsheet -- Enzyme Inhibition Constant Data from BindingDB
Found 1 hit for monomerid = 50150526
TargetCathepsin K(Oryctolagus cuniculus (rabbit))
Merck Frosst Centre For Therapeutic Research
Curated by ChEMBL
LigandPNGBDBM50150526(2-(3-Bromo-phenylamino)-4-methyl-pentanoic acid cy...)
Affinity DataIC50:  72nM. Assay description: Inhibitory concentration against humanized rabbit cathepsin K
In DepthDetails ArticlePubMed