BDBM50150537 2-(4-Bromo-benzyl)-4-methyl-pentanoic acid cyanomethyl-amide::CHEMBL185593
SMILES CC(C)CC(Cc1ccc(Br)cc1)C(=O)NCC#N
InChI Key InChIKey=BNNNCEUUQSBHCL-UHFFFAOYSA-N
Data  1 IC50
  Tab Delimited (TSV)   2D SDfile   Computed 3D by Vconf -m prep SDfile
Find this compound or compounds like it in BindingDB:
Activity Spreadsheet -- Enzyme Inhibition Constant Data from BindingDB
Found 1 hit for monomerid = 50150537
TargetCathepsin K(Oryctolagus cuniculus (rabbit))
Merck Frosst Centre For Therapeutic Research
Curated by ChEMBL
LigandPNGBDBM50150537(2-(4-Bromo-benzyl)-4-methyl-pentanoic acid cyanome...)
Affinity DataIC50:  2.39E+3nM. Assay description: Inhibitory concentration against humanized rabbit cathepsin K
In DepthDetails ArticlePubMed