BDBM50150589 (E)-(S)-4-{[(S)-3,3-Dimethyl-2-((S)-3-methyl-2-methylamino-3-phenyl-butyrylamino)-butyryl]-methyl-amino}-2,5-dimethyl-hex-2-enoic acid::(S)-2,5-dimethyl-4-((S)-N,3,3-trimethyl-2-((S)-3-methyl-2-(methylamino)-3-phenylbutanamido)butanamido)hex-2-enoic acid::(S,E)-2,5-dimethyl-4-((S)-N,3,3-trimethyl-2-((S)-3-methyl-2-(methylamino)-3-phenylbutanamido)butanamido)hex-2-enoic acid::4-{[3,3-Dimethyl-2-(3-methyl-2-methylamino-3-phenyl-butyrylamino)-butyryl]-methyl-amino}-2,5-dimethyl-hex-2-enoic acid::CHEMBL182319::PHENYLHEMIASTERLIN
SMILES CN[C@H](C(=O)N[C@H](C(=O)N(C)[C@H](\C=C(/C)C(O)=O)C(C)C)C(C)(C)C)C(C)(C)c1ccccc1
InChI Key InChIKey=CNTMOLDWXSVYKD-PSRNMDMQSA-N
Data  1 Kd
  Tab Delimited (TSV)   2D SDfile   Computed 3D by Vconf -m prep SDfile
Find this compound or compounds like it in BindingDB:
Activity Spreadsheet -- Enzyme Inhibition Constant Data from BindingDB
Found 1 hit for monomerid = 50150589
TargetTubulin beta-1 chain(Homo sapiens (Human))
Wyeth Research
Curated by ChEMBL
LigandPNGBDBM50150589((E)-(S)-4-{[(S)-3,3-Dimethyl-2-((S)-3-methyl-2-met...)
Affinity DataKd:  260nM. Assay description: Binding affinity towards tubulin
In DepthDetails ArticlePubMed