BDBM50150612 CHEMBL181402::CHEMBL182548::Phosphoric acid mono-{2-[1-(1,5-dimethyl-hexyl)-4,7a-dimethyl-octahydro-inden-4-yl]-ethyl} ester
SMILES CC(C)CCC[C@@H](C)[C@H]1CCC2[C@]1(C)CCCC2(C)CCOP(O)(O)=O
InChI Key InChIKey=JTUAZBDUOANPSM-SEHPAMGUSA-N
Data  4 IC50
  Tab Delimited (TSV)   2D SDfile   Computed 3D by Vconf -m prep SDfile
Find this compound or compounds like it in BindingDB:
Activity Spreadsheet -- Enzyme Inhibition Constant Data from BindingDB
Found 4 hits for monomerid = 50150612
TargetM-phase inducer phosphatase 2(Homo sapiens (Human))
The University Of Tokyo
Curated by ChEMBL
LigandPNGBDBM50150612(CHEMBL181402 | CHEMBL182548 | Phosphoric acid mono...)
Affinity DataIC50:  6.80E+3nM. Assay description: Inhibitory concentration agaunst dual-specificity phosphatase Cell division cycle (Cdc) 25B
In DepthDetails ArticlePubMed
TargetM-phase inducer phosphatase 2(Homo sapiens (Human))
The University Of Tokyo
Curated by ChEMBL
LigandPNGBDBM50150612(CHEMBL181402 | CHEMBL182548 | Phosphoric acid mono...)
Affinity DataIC50:  1.20E+3nM. Assay description: Inhibitory concentration agaunst dual-specificity phosphatase Cell division cycle (Cdc) 25B
In DepthDetails ArticlePubMed
TargetM-phase inducer phosphatase 1(Homo sapiens (Human))
The University Of Tokyo
Curated by ChEMBL
LigandPNGBDBM50150612(CHEMBL181402 | CHEMBL182548 | Phosphoric acid mono...)
Affinity DataIC50:  5.50E+3nM. Assay description: Inhibitory concentration againsts dual-specificity phosphatase Cell division cycle (Cdc) 25A
In DepthDetails ArticlePubMed
TargetM-phase inducer phosphatase 1(Homo sapiens (Human))
The University Of Tokyo
Curated by ChEMBL
LigandPNGBDBM50150612(CHEMBL181402 | CHEMBL182548 | Phosphoric acid mono...)
Affinity DataIC50:  2.45E+4nM. Assay description: Inhibitory concentration againsts dual-specificity phosphatase Cell division cycle (Cdc) 25A
In DepthDetails ArticlePubMed