BDBM50150664 (S)-2-({(2S,3S,6S)-6-[((R)-2-Amino-3-tert-butyldisulfanyl-propionylamino)-methyl]-3-benzyloxy-tetrahydro-pyran-2-carbonyl}-amino)-4-methanesulfinyl-butyric acid::CHEMBL365616
SMILES CS(=O)CC[C@H](NC(=O)[C@H]1O[C@H](CNC(=O)[C@@H](N)CSSC(C)(C)C)CC[C@@H]1OCc1ccccc1)C(O)=O
InChI Key InChIKey=ORZKKQUVLOUJDP-MWQUXWBMSA-N
Data  2 IC50
  Tab Delimited (TSV)   2D SDfile   Computed 3D by Vconf -m prep SDfile
Find this compound or compounds like it in BindingDB:
Activity Spreadsheet -- Enzyme Inhibition Constant Data from BindingDB
Found 2 hits for monomerid = 50150664
LigandPNGBDBM50150664((S)-2-({(2S,3S,6S)-6-[((R)-2-Amino-3-tert-butyldis...)
Affinity DataIC50:  5.21E+5nM. Assay description: Inhibition of [3H]GGPP incorporation by Protein Geranylgeranyl transferase type I
In DepthDetails ArticlePubMed
LigandPNGBDBM50150664((S)-2-({(2S,3S,6S)-6-[((R)-2-Amino-3-tert-butyldis...)
Affinity DataIC50:  9.10E+4nM. Assay description: Inhibition of [3H]FPP incorporation by Protein Farnesyltransferase
In DepthDetails ArticlePubMed