BDBM50150665 (S)-2-({(2S,3S,6S)-6-[((R)-2-Amino-3-tert-butyldisulfanyl-propionylamino)-methyl]-3-benzyloxy-tetrahydro-pyran-2-carbonyl}-amino)-4-methylsulfanyl-butyric acid::CHEMBL185908
SMILES CSCC[C@H](NC(=O)[C@H]1O[C@H](CNC(=O)[C@@H](N)CSSC(C)(C)C)CC[C@@H]1OCc1ccccc1)C(O)=O
InChI Key InChIKey=KKJHVJLHXZFOFV-YFNVTMOMSA-N
Data  2 IC50
  Tab Delimited (TSV)   2D SDfile   Computed 3D by Vconf -m prep SDfile
Find this compound or compounds like it in BindingDB:
Activity Spreadsheet -- Enzyme Inhibition Constant Data from BindingDB
Found 2 hits for monomerid = 50150665
LigandPNGBDBM50150665((S)-2-({(2S,3S,6S)-6-[((R)-2-Amino-3-tert-butyldis...)
Affinity DataIC50:  4.20E+4nM. Assay description: Inhibition of [3H]FPP incorporation by Protein Farnesyltransferase
In DepthDetails ArticlePubMed
LigandPNGBDBM50150665((S)-2-({(2S,3S,6S)-6-[((R)-2-Amino-3-tert-butyldis...)
Affinity DataIC50:  4.80E+4nM. Assay description: Inhibition of [3H]GGPP incorporation by Protein Geranylgeranyl transferase type I
In DepthDetails ArticlePubMed