BDBM50150721 3-(4-Methanesulfonyl-phenyl)-6-phenyl-4-pyridin-3-yl-pyran-2-one::CHEMBL360200
SMILES CS(=O)(=O)c1ccc(cc1)-c1c(cc(oc1=O)-c1ccccc1)-c1cccnc1
InChI Key InChIKey=KBTNUIBNCVVZKJ-UHFFFAOYSA-N
Data  2 IC50
  Tab Delimited (TSV)   2D SDfile   Computed 3D by Vconf -m prep SDfile
Find this compound or compounds like it in BindingDB:
Activity Spreadsheet -- Enzyme Inhibition Constant Data from BindingDB
Found 2 hits for monomerid = 50150721
TargetProstaglandin G/H synthase 2(Ovis aries (Sheep))
University Of Alberta
Curated by ChEMBL
LigandPNGBDBM50150721(3-(4-Methanesulfonyl-phenyl)-6-phenyl-4-pyridin-3-...)
Affinity DataIC50:  8.00E+3nM. Assay description: Inhibition of ovine Prostaglandin G/H synthase 2
In DepthDetails ArticlePubMed
TargetProstaglandin G/H synthase 1(Ovis aries (Sheep))
University Of Alberta
Curated by ChEMBL
LigandPNGBDBM50150721(3-(4-Methanesulfonyl-phenyl)-6-phenyl-4-pyridin-3-...)
Affinity DataIC50:  3.00E+3nM. Assay description: Inhibition of ovine Prostaglandin G/H synthase 1
In DepthDetails ArticlePubMed