BDBM50150724 4-(4-Methanesulfonyl-phenyl)-6-(4-methylsulfanyl-phenyl)-3-phenyl-pyran-2-one::CHEMBL186351
SMILES CSc1ccc(cc1)-c1cc(-c2ccc(cc2)S(C)(=O)=O)c(-c2ccccc2)c(=O)o1
InChI Key InChIKey=VDKZQYMMGKZJAC-UHFFFAOYSA-N
Data  2 IC50
  Tab Delimited (TSV)   2D SDfile   Computed 3D by Vconf -m prep SDfile
Find this compound or compounds like it in BindingDB:
Activity Spreadsheet -- Enzyme Inhibition Constant Data from BindingDB
Found 2 hits for monomerid = 50150724
TargetProstaglandin G/H synthase 1(Ovis aries (Sheep))
University Of Alberta
Curated by ChEMBL
LigandPNGBDBM50150724(4-(4-Methanesulfonyl-phenyl)-6-(4-methylsulfanyl-p...)
Affinity DataIC50:  3.12E+4nM. Assay description: Inhibition of ovine Prostaglandin G/H synthase 1
In DepthDetails ArticlePubMed
TargetProstaglandin G/H synthase 2(Ovis aries (Sheep))
University Of Alberta
Curated by ChEMBL
LigandPNGBDBM50150724(4-(4-Methanesulfonyl-phenyl)-6-(4-methylsulfanyl-p...)
Affinity DataIC50:  4.50E+3nM. Assay description: Inhibition of ovine Prostaglandin G/H synthase 2
In DepthDetails ArticlePubMed