BDBM50150725 6-(4-Hydroxy-phenyl)-3-(4-methanesulfonyl-phenyl)-4-phenyl-pyran-2-one::CHEMBL363547
SMILES CS(=O)(=O)c1ccc(cc1)-c1c(cc(oc1=O)-c1ccc(O)cc1)-c1ccccc1
InChI Key InChIKey=VIVAKNAVLHNDRM-UHFFFAOYSA-N
Data  2 IC50
  Tab Delimited (TSV)   2D SDfile   Computed 3D by Vconf -m prep SDfile
Find this compound or compounds like it in BindingDB:
Activity Spreadsheet -- Enzyme Inhibition Constant Data from BindingDB
Found 2 hits for monomerid = 50150725
TargetProstaglandin G/H synthase 2(Ovis aries (Sheep))
University Of Alberta
Curated by ChEMBL
LigandPNGBDBM50150725(6-(4-Hydroxy-phenyl)-3-(4-methanesulfonyl-phenyl)-...)
Affinity DataIC50: >1.00E+5nM. Assay description: Inhibition of ovine Prostaglandin G/H synthase 2
In DepthDetails ArticlePubMed
TargetProstaglandin G/H synthase 1(Ovis aries (Sheep))
University Of Alberta
Curated by ChEMBL
LigandPNGBDBM50150725(6-(4-Hydroxy-phenyl)-3-(4-methanesulfonyl-phenyl)-...)
Affinity DataIC50: >1.00E+5nM. Assay description: Inhibition of ovine Prostaglandin G/H synthase 1
In DepthDetails ArticlePubMed