BDBM50150897 (Z)-8-[(2R,3S,4R)-4-Hydroxy-2-((E)-(S)-3-hydroxy-4-phenoxy-but-1-enyl)-tetrahydro-furan-3-yl]-oct-4-enoic acid::CHEMBL363946
SMILES O[C@H](COc1ccccc1)\C=C\[C@H]1OC[C@H](O)[C@@H]1CCC\C=C/CCC(O)=O
InChI Key InChIKey=ITIXNUZFXYCYOE-UXRIAZJMSA-N
Data  1 KI  1 EC50
  Tab Delimited (TSV)   2D SDfile   Computed 3D by Vconf -m prep SDfile
Find this compound or compounds like it in BindingDB:
Activity Spreadsheet -- Enzyme Inhibition Constant Data from BindingDB
Found 2 hits for monomerid = 50150897
TargetProstaglandin F2-alpha receptor(BOVINE)
Alcon Research
Curated by ChEMBL
LigandPNGBDBM50150897((Z)-8-[(2R,3S,4R)-4-Hydroxy-2-((E)-(S)-3-hydroxy-4...)
Affinity DataKi:  5.10E+3nM. Assay description: Binding affinity for Prostanoid FP receptor of bovine corpus luteum
In DepthDetails ArticlePubMed
TargetProstaglandin F2-alpha receptor(Homo sapiens (Human))
Alcon Research
Curated by ChEMBL
LigandPNGBDBM50150897((Z)-8-[(2R,3S,4R)-4-Hydroxy-2-((E)-(S)-3-hydroxy-4...)
Affinity DataEC50:  252nM. Assay description: Efficacy for stimulation of prostanoid FP receptor-linked phosphoinositide turnover in Swiss 3T3 mouse fibroblast cells
In DepthDetails ArticlePubMed