BDBM50150942 CHEMBL3394209
SMILES CCCCOC(=O)NS(=O)(=O)c1cc(CC(C)C)ccc1-c1cccc(Cn2ccnc2)c1
InChI Key InChIKey=DSLKRBLDSLJSPD-UHFFFAOYSA-N
Data  1 KI
  Tab Delimited (TSV)   2D SDfile   Computed 3D by Vconf -m prep SDfile
Find this compound or compounds like it in BindingDB:
Activity Spreadsheet -- Enzyme Inhibition Constant Data from BindingDB
Found 1 hit for monomerid = 50150942
TargetType-2 angiotensin II receptor(Homo sapiens (Human))
University Of Minnesota
Curated by ChEMBL
LigandPNGBDBM50150942(CHEMBL3394209)
Affinity DataKi:  8.20nM. Assay description: Inhibition of KDM5B (unknown origin) using biotin-H3K4me3 as substrate preincubated for 15 mins followed by substrate addition measured after 20 mins...
In DepthDetails ArticlePubMed