BDBM50151251 CHEMBL3771186
SMILES C(C1COC(S1)(c1ccccc1)c1ccccc1)N1CCC(Cc2ccccc2)CC1
InChI Key InChIKey=IDWFOHZCDPPWEM-UHFFFAOYSA-N
Data  2 KI
  Tab Delimited (TSV)   2D SDfile   Computed 3D by Vconf -m prep SDfile
Find this compound or compounds like it in BindingDB:
Activity Spreadsheet -- Enzyme Inhibition Constant Data from BindingDB
Found 2 hits for monomerid = 50151251
TargetSigma non-opioid intracellular receptor 1(Cavia porcellus (Guinea pig))
Universit£
Curated by ChEMBL
LigandPNGBDBM50151251(CHEMBL3771186)
Affinity DataKi:  12nM. Assay description: Displacement of [3H]-(+)-pentazocine from sigma-1 receptor in guinea pig brain membranes after 150 mins by liquid scintillation counting method
In DepthDetails ArticlePubMed
Target5-hydroxytryptamine receptor 1A(Homo sapiens (Human))
Universit£
Curated by ChEMBL
LigandPNGBDBM50151251(CHEMBL3771186)
Affinity DataKi: <1.00E+3nM. Assay description: Displacement of [3H]8-OH-DPAT from human 5-HT1A expressed in human HeLa cells after 30 mins
In DepthDetails ArticlePubMed