BDBM50151656 CHEMBL3774491
SMILES NC(=N)NCCC[C@@H]1NC(=O)\C(NC1=O)=C\c1ccc(O)c(OCC[C@H](NC(=O)C[C@](O)(CC(O)=O)C(O)=O)C(O)=O)c1
InChI Key InChIKey=GRAFKVRBLJRCBH-NCBISDQCSA-N
Data  1 IC50
  Tab Delimited (TSV)   2D SDfile   Computed 3D by Vconf -m prep SDfile
Find this compound or compounds like it in BindingDB:
Activity Spreadsheet -- Enzyme Inhibition Constant Data from BindingDB
Found 1 hit for monomerid = 50151656
TargetHistone acetyltransferase p300(Homo sapiens (Human))
University Of Freiburg
Curated by ChEMBL
LigandPNGBDBM50151656(CHEMBL3774491)
Affinity DataIC50:  22nM. Assay description: Inhibition of human recombinant C-terminal GST-tagged p300 (1195 to 1673 residues) expressed in competent Escherichia coli DH5alpha cells using histo...
In DepthDetails ArticlePubMed