BDBM50151718 CHEMBL440561::N-[2-Hydroxy-5-((R)-1-hydroxy-2-{2-[3-(4-phenyl-butoxy)-phenyl]-ethylamino}-ethyl)-phenyl]-formamide
SMILES O[C@@H](CNCCc1cccc(OCCCCc2ccccc2)c1)c1ccc(O)c(NC=O)c1
InChI Key InChIKey=QFBJPKMEGRWYBI-MHZLTWQESA-N
Data  1 KI
  Tab Delimited (TSV)   2D SDfile   Computed 3D by Vconf -m prep SDfile
Find this compound or compounds like it in BindingDB:
Activity Spreadsheet -- Enzyme Inhibition Constant Data from BindingDB
Found 1 hit for monomerid = 50151718
TargetBeta-2 adrenergic receptor(Homo sapiens (Human))
Novartis Horsham Research Centre
Curated by ChEMBL
LigandPNGBDBM50151718(CHEMBL440561 | N-[2-Hydroxy-5-((R)-1-hydroxy-2-{2-...)
Affinity DataKi:  8.5nM. Assay description: Binding affinity for human beta-2 adrenergic receptor
In DepthDetails ArticlePubMed