BDBM50151732 4-[4-(2,4-Dichloro-benzyloxy)-benzenesulfonyl]-3-hydroxy-tetrahydro-pyran-3-carboxylic acid hydroxyamide::CHEMBL366111
SMILES ONC(=O)[C@@]1(O)COCC[C@H]1S(=O)(=O)c1ccc(OCc2ccc(Cl)cc2Cl)cc1
InChI Key InChIKey=WJULIBHPWZXMJA-IEBWSBKVSA-N
Data  8 IC50
  Tab Delimited (TSV)   2D SDfile   Computed 3D by Vconf -m prep SDfile
Find this compound or compounds like it in BindingDB:
Activity Spreadsheet -- Enzyme Inhibition Constant Data from BindingDB
Found 8 hits for monomerid = 50151732
LigandPNGBDBM50151732(4-[4-(2,4-Dichloro-benzyloxy)-benzenesulfonyl]-3-h...)
Affinity DataIC50:  8.10nM. Assay description: Inhibitory concentration against aggrecanase
In DepthDetails ArticlePubMed
TargetMatrix metalloproteinase-9(Homo sapiens (Human))
Pfizer
Curated by ChEMBL
LigandPNGBDBM50151732(4-[4-(2,4-Dichloro-benzyloxy)-benzenesulfonyl]-3-h...)
Affinity DataIC50:  5.30nM. Assay description: Inhibition of matrix metalloprotease 9
In DepthDetails ArticlePubMed
TargetMatrix metalloproteinase-14(Homo sapiens (Human))
Pfizer
Curated by ChEMBL
LigandPNGBDBM50151732(4-[4-(2,4-Dichloro-benzyloxy)-benzenesulfonyl]-3-h...)
Affinity DataIC50:  150nM. Assay description: Inhibition of matrix metalloprotease 14
In DepthDetails ArticlePubMed
TargetMacrophage metalloelastase(Homo sapiens (Human))
Pfizer
Curated by ChEMBL
LigandPNGBDBM50151732(4-[4-(2,4-Dichloro-benzyloxy)-benzenesulfonyl]-3-h...)
Affinity DataIC50:  0.950nM. Assay description: Inhibition of matrix metalloprotease 12
In DepthDetails ArticlePubMed
Target72 kDa type IV collagenase(Homo sapiens (Human))
Pfizer
Curated by ChEMBL
LigandPNGBDBM50151732(4-[4-(2,4-Dichloro-benzyloxy)-benzenesulfonyl]-3-h...)
Affinity DataIC50:  12nM. Assay description: Inhibition of matrix metalloprotease 2
In DepthDetails ArticlePubMed
TargetInterstitial collagenase(Homo sapiens (Human))
Pfizer
Curated by ChEMBL
LigandPNGBDBM50151732(4-[4-(2,4-Dichloro-benzyloxy)-benzenesulfonyl]-3-h...)
Affinity DataIC50:  920nM. Assay description: Inhibitory concentration against matrix metalloprotease 1
In DepthDetails ArticlePubMed
TargetStromelysin-1(Homo sapiens (Human))
Pfizer
Curated by ChEMBL
LigandPNGBDBM50151732(4-[4-(2,4-Dichloro-benzyloxy)-benzenesulfonyl]-3-h...)
Affinity DataIC50:  55nM. Assay description: Inhibition of matrix metalloprotease 3
In DepthDetails ArticlePubMed
TargetCollagenase 3(Homo sapiens (Human))
Pfizer
Curated by ChEMBL
LigandPNGBDBM50151732(4-[4-(2,4-Dichloro-benzyloxy)-benzenesulfonyl]-3-h...)
Affinity DataIC50:  0.950nM. Assay description: Inhibitory concentration against matrix metalloprotease 13
In DepthDetails ArticlePubMed