BDBM50151779 (4-Fluoro-phenyl)-(6-methanesulfonyl-2-methyl-1H-indol-3-yl)-methanone::CHEMBL361055
SMILES Cc1[nH]c2cc(ccc2c1C(=O)c1ccc(F)cc1)S(C)(=O)=O
InChI Key InChIKey=DTRRRMIIVDWNKP-UHFFFAOYSA-N
Data  3 IC50
  Tab Delimited (TSV)   2D SDfile   Computed 3D by Vconf -m prep SDfile
Find this compound or compounds like it in BindingDB:
Activity Spreadsheet -- Enzyme Inhibition Constant Data from BindingDB
Found 3 hits for monomerid = 50151779
TargetProstaglandin G/H synthase 1(Homo sapiens (Human))
Roche Palo Alto
Curated by ChEMBL
LigandPNGBDBM50151779((4-Fluoro-phenyl)-(6-methanesulfonyl-2-methyl-1H-i...)
Affinity DataIC50:  2.44E+3nM. Assay description: Inhibitory concentration against human whole blood Prostaglandin G/H synthase 1 enzyme activity
In DepthDetails ArticlePubMed
TargetProstaglandin G/H synthase 2(Homo sapiens (Human))
Roche Palo Alto
Curated by ChEMBL
LigandPNGBDBM50151779((4-Fluoro-phenyl)-(6-methanesulfonyl-2-methyl-1H-i...)
Affinity DataIC50:  1.72E+3nM. Assay description: Inhibitory concentration against human whole blood Prostaglandin G/H synthase 2 enzyme activity was determined
In DepthDetails ArticlePubMed
TargetProstaglandin G/H synthase 2(Homo sapiens (Human))
Roche Palo Alto
Curated by ChEMBL
LigandPNGBDBM50151779((4-Fluoro-phenyl)-(6-methanesulfonyl-2-methyl-1H-i...)
Affinity DataIC50:  660nM. Assay description: In vitro inhibitory concentration against Prostaglandin G/H synthase 2 enzyme activity
In DepthDetails ArticlePubMed