BDBM50151780 3-(4-Fluoro-phenylsulfanyl)-6-methanesulfonyl-1H-indole-2-carboxylic acid amide::CHEMBL366121
SMILES CS(=O)(=O)c1ccc2c(Sc3ccc(F)cc3)c([nH]c2c1)C(N)=O
InChI Key InChIKey=TXPRFIRYMHWJRY-UHFFFAOYSA-N
Data  3 IC50
  Tab Delimited (TSV)   2D SDfile   Computed 3D by Vconf -m prep SDfile
Find this compound or compounds like it in BindingDB:
Activity Spreadsheet -- Enzyme Inhibition Constant Data from BindingDB
Found 3 hits for monomerid = 50151780
TargetProstaglandin G/H synthase 1(Homo sapiens (Human))
Roche Palo Alto
Curated by ChEMBL
LigandPNGBDBM50151780(3-(4-Fluoro-phenylsulfanyl)-6-methanesulfonyl-1H-i...)
Affinity DataIC50: >4.00E+4nM. Assay description: Inhibitory concentration against human whole blood Prostaglandin G/H synthase 1 enzyme activity
In DepthDetails ArticlePubMed
TargetProstaglandin G/H synthase 2(Homo sapiens (Human))
Roche Palo Alto
Curated by ChEMBL
LigandPNGBDBM50151780(3-(4-Fluoro-phenylsulfanyl)-6-methanesulfonyl-1H-i...)
Affinity DataIC50: >4.00E+4nM. Assay description: Inhibitory concentration against human whole blood Prostaglandin G/H synthase 2 enzyme activity was determined
In DepthDetails ArticlePubMed
TargetProstaglandin G/H synthase 2(Homo sapiens (Human))
Roche Palo Alto
Curated by ChEMBL
LigandPNGBDBM50151780(3-(4-Fluoro-phenylsulfanyl)-6-methanesulfonyl-1H-i...)
Affinity DataIC50:  1.21E+3nM. Assay description: In vitro inhibitory concentration against Prostaglandin G/H synthase 2 enzyme activity
In DepthDetails ArticlePubMed