BDBM50152083 1-[9-(3,4-Dihydroxy-5-hydroxymethyl-tetrahydro-furan-2-yl)-6-methylamino-9H-purin-2-yl]-1H-pyrazole-4-carboxylic acid ethylamide::CHEMBL188454
SMILES CCNC(=O)c1cnn(c1)-c1nc(NC)c2ncn(C3O[C@H](CO)[C@@H](O)[C@H]3O)c2n1
InChI Key InChIKey=RCTSETQTWYCFHZ-JZVWYZPUSA-N
Data  1 KI
  Tab Delimited (TSV)   2D SDfile   Computed 3D by Vconf -m prep SDfile
Find this compound or compounds like it in BindingDB:
Activity Spreadsheet -- Enzyme Inhibition Constant Data from BindingDB
Found 1 hit for monomerid = 50152083
TargetAdenosine receptor A3(Homo sapiens (Human))
Cv Therapeutics
Curated by ChEMBL
LigandPNGBDBM50152083(1-[9-(3,4-Dihydroxy-5-hydroxymethyl-tetrahydro-fur...)
Affinity DataKi:  49nM. Assay description: Displacement of [125I]-AB MECA from recombinant human adenosine A3 receptor expressed in HEK cells
In DepthDetails ArticlePubMed