BDBM50152129 CHEMBL3780596
SMILES CN(CC(C)(C)CO)c1nc(N)ncc1C
InChI Key InChIKey=ICVSZEUGGJAUNU-UHFFFAOYSA-N
Data  1 IC50
  Tab Delimited (TSV)   2D SDfile   Computed 3D by Vconf -m prep SDfile
Find this compound or compounds like it in BindingDB:
Activity Spreadsheet -- Enzyme Inhibition Constant Data from BindingDB
Found 1 hit for monomerid = 50152129
TargetOxidized purine nucleoside triphosphate hydrolase(Homo sapiens (Human))
Md Anderson Cancer Center
Curated by ChEMBL
LigandPNGBDBM50152129(CHEMBL3780596)
Affinity DataIC50:  0.5nM. Assay description: Inhibition of recombinant MTH1 (unknown origin) assessed as hydrolysis of 8-oxodGTP to 8-oxodGMP and pyrophosphate by PPiLight assay
In DepthDetails ArticlePubMed