BDBM50152854 3-(5-Methoxy-indole-1-sulfonyl)-thiophene-2-carboxylic acid::CHEMBL183798
SMILES COc1ccc2n(ccc2c1)S(=O)(=O)c1ccsc1C(O)=O
InChI Key InChIKey=VQIYNXAHWZQTML-UHFFFAOYSA-N
Data  1 IC50
  Tab Delimited (TSV)   2D SDfile   Computed 3D by Vconf -m prep SDfile
Find this compound or compounds like it in BindingDB:
Activity Spreadsheet -- Enzyme Inhibition Constant Data from BindingDB
Found 2 hits for monomerid = 50152854
TargetFatty acid-binding protein, adipocyte(Homo sapiens (Human))TBA
LigandPNGBDBM50152854(3-(5-Methoxy-indole-1-sulfonyl)-thiophene-2-carbox...)
Affinity DataIC50:  1.00E+4nM
In DepthDetails
TargetFatty acid-binding protein, adipocyte(Homo sapiens (Human))TBA
LigandPNGBDBM50152854(3-(5-Methoxy-indole-1-sulfonyl)-thiophene-2-carbox...)
Affinity DataIC50:  1.00E+4nM. Assay description: In vitro inhibitory concentration against adipocyte fatty acid binding protein(A-FABP)
In DepthDetails ArticlePubMed