BDBM50152912 1-sec-Butyl-3-[4-(2-methyl-quinolin-4-ylmethoxy)-benzenesulfonylmethyl]-piperidine-4-carboxylic acid hydroxyamide::CHEMBL184942
SMILES CCC(C)N1CCC(C(CS(=O)(=O)c2ccc(OCc3cc(C)nc4ccccc34)cc2)C1)C(=O)NO
InChI Key InChIKey=XDBJJTDYSZNDQT-UHFFFAOYSA-N
Data  4 KI  2 IC50
  Tab Delimited (TSV)   2D SDfile   Computed 3D by Vconf -m prep SDfile
Find this compound or compounds like it in BindingDB:
Activity Spreadsheet -- Enzyme Inhibition Constant Data from BindingDB
Found 6 hits for monomerid = 50152912
TargetMatrix metalloproteinase-9(Homo sapiens (Human))
Bristol-Myers Squibb Pharmaceutical Research Institute
Curated by ChEMBL
LigandPNGBDBM50152912(1-sec-Butyl-3-[4-(2-methyl-quinolin-4-ylmethoxy)-b...)
Affinity DataKi: >2.10E+3nM. Assay description: Inhibition of Matrix metalloprotease-9 (MMP-9)
In DepthDetails ArticlePubMed
Target72 kDa type IV collagenase(Homo sapiens (Human))
Bristol-Myers Squibb Pharmaceutical Research Institute
Curated by ChEMBL
LigandPNGBDBM50152912(1-sec-Butyl-3-[4-(2-methyl-quinolin-4-ylmethoxy)-b...)
Affinity DataKi: >3.30E+3nM. Assay description: inhibition of Matrix metalloprotease-2 (MMP-2)
In DepthDetails ArticlePubMed
TargetInterstitial collagenase(Homo sapiens (Human))
Bristol-Myers Squibb Pharmaceutical Research Institute
Curated by ChEMBL
LigandPNGBDBM50152912(1-sec-Butyl-3-[4-(2-methyl-quinolin-4-ylmethoxy)-b...)
Affinity DataKi: >4.90E+3nM. Assay description: Inhibition of Matrix metalloprotease-1 (MMP-1)
In DepthDetails ArticlePubMed
TargetCollagenase 3(Homo sapiens (Human))
Bristol-Myers Squibb Pharmaceutical Research Institute
Curated by ChEMBL
LigandPNGBDBM50152912(1-sec-Butyl-3-[4-(2-methyl-quinolin-4-ylmethoxy)-b...)
Affinity DataKi: >5.00E+3nM. Assay description: Inhibition of Matrix metalloprotease-13 (MMP-13)
In DepthDetails ArticlePubMed
TargetDisintegrin and metalloproteinase domain-containing protein 17(Homo sapiens (Human))
Bristol-Myers Squibb Pharmaceutical Research Institute
Curated by ChEMBL
LigandPNGBDBM50152912(1-sec-Butyl-3-[4-(2-methyl-quinolin-4-ylmethoxy)-b...)
Affinity DataIC50:  1.07E+3nM. Assay description: Effect on TNF-Alpha release in LPS-stimulated human whole blood assay
In DepthDetails ArticlePubMed
TargetDisintegrin and metalloproteinase domain-containing protein 17(Sus scrofa (pig))
Bristol-Myers Squibb Pharmaceutical Research Institute
Curated by ChEMBL
LigandPNGBDBM50152912(1-sec-Butyl-3-[4-(2-methyl-quinolin-4-ylmethoxy)-b...)
Affinity DataIC50: <1nM. Assay description: Inhibition of porcine Tumor necrosis factor- alpha converting enzyme (TACE, ADAM17)
In DepthDetails ArticlePubMed